Target
Tyrosine-protein phosphatase non-receptor type 11
Ligand
BDBM82647
Substrate
Meas. Tech.
Dose Response selectivity of inhibitors of Striatal-Enriched Phosphatase (STEP) in a SHP2 (PTPN11) Inhibition Assay
IC50
603±n/a nM
Citation
 PubChem, PC Dose Response selectivity of inhibitors of Striatal-Enriched Phosphatase (STEP) in a SHP2 (PTPN11) Inhibition Assay PubChem Bioassay (2012)[AID] 
Target
Name:
Tyrosine-protein phosphatase non-receptor type 11
Synonyms:
PTN11_HUMAN PTP-2C PTPN11 Protein tyrosine phosphatase (PTP) Shp2 Protein-tyrosine phosphatase 2C SHP2 Src homology phosphatase 2 (SHP-2) Tyrosine-protein phosphatase non-receptor type 11 (PTPN11) Tyrosine-protein phosphatase non-receptor type 11 (SHP2)
Type:
Protein phosphatase
Mol. Mass.:
68443.59
Organism:
Homo sapiens (Human)
Description:
Q06124
Residue:
597
  
Inhibitor
Name:
BDBM82647
Synonyms:
2-(1H-benzimidazol-2-ylsulfanyl)-1-(2,3-dimethylindol-1-yl)ethanone 2-(1H-benzimidazol-2-ylthio)-1-(2,3-dimethylindol-1-yl)ethanone MLS000535320 cid_704124
Type:
Small organic molecule
Emp. Form.:
C19H17N3OS
Mol. Mass.:
335.423
SMILES:
Cc1c(C)c2ccccc2n1C(=O)CSc1nc2ccccc2[nH]1
: