Target
Tyrosine-protein phosphatase non-receptor type 11
Ligand
BDBM88770
Substrate
Meas. Tech.
Dose Response selectivity of inhibitors of Striatal-Enriched Phosphatase (STEP) in a SHP2 (PTPN11) Inhibition Assay
IC50
11800±n/a nM
Citation
 PubChem, PC Dose Response selectivity of inhibitors of Striatal-Enriched Phosphatase (STEP) in a SHP2 (PTPN11) Inhibition Assay PubChem Bioassay (2012)[AID] 
Target
Name:
Tyrosine-protein phosphatase non-receptor type 11
Synonyms:
PTN11_HUMAN PTP-2C PTPN11 Protein tyrosine phosphatase (PTP) Shp2 Protein-tyrosine phosphatase 2C SHP2 Src homology phosphatase 2 (SHP-2) Tyrosine-protein phosphatase non-receptor type 11 (PTPN11) Tyrosine-protein phosphatase non-receptor type 11 (SHP2)
Type:
Protein phosphatase
Mol. Mass.:
68443.59
Organism:
Homo sapiens (Human)
Description:
Q06124
Residue:
597
  
Inhibitor
Name:
BDBM88770
Synonyms:
4-[(5-chloro-2-methyl-phenyl)thiocarbamoyl-[2-(dimethylamino)ethyl]amino]piperidine-1-carboxylic acid ethyl ester MLS000689480 cid_16195569 ethyl 4-[(5-chloro-2-methylphenyl)carbamothioyl-[2-(dimethylamino)ethyl]amino]piperidine-1-carboxylate | ethyl 4-{{[(5-chloro-2-methylphenyl)amino]carbonothioyl}[2-(dimethylamino)ethyl]amino}piperidine-1-carboxylate
Type:
Small organic molecule
Emp. Form.:
C20H31ClN4O2S
Mol. Mass.:
427.004
SMILES:
CCOC(=O)N1CCC(CC1)N(CCN(C)C)C(=S)Nc1cc(Cl)ccc1C
: