Target
Tyrosine-protein phosphatase non-receptor type 11
Ligand
BDBM53567
Substrate
Meas. Tech.
Dose Response selectivity of inhibitors of Striatal-Enriched Phosphatase (STEP) in a SHP2 (PTPN11) Inhibition Assay
IC50
409±n/a nM
Citation
 PubChem, PC Dose Response selectivity of inhibitors of Striatal-Enriched Phosphatase (STEP) in a SHP2 (PTPN11) Inhibition Assay PubChem Bioassay (2012)[AID] 
Target
Name:
Tyrosine-protein phosphatase non-receptor type 11
Synonyms:
PTN11_HUMAN PTP-2C PTPN11 Protein tyrosine phosphatase (PTP) Shp2 Protein-tyrosine phosphatase 2C SHP2 Src homology phosphatase 2 (SHP-2) Tyrosine-protein phosphatase non-receptor type 11 (PTPN11) Tyrosine-protein phosphatase non-receptor type 11 (SHP2)
Type:
Protein phosphatase
Mol. Mass.:
68443.59
Organism:
Homo sapiens (Human)
Description:
Q06124
Residue:
597
  
Inhibitor
Name:
BDBM53567
Synonyms:
5-(2,4-dichlorophenyl)-N-[4-(3-methyl-[1,2,4]triazolo[3,4-b][1,3,4]thiadiazol-6-yl)phenyl]-2-furamide 5-(2,4-dichlorophenyl)-N-[4-(3-methyl-[1,2,4]triazolo[3,4-b][1,3,4]thiadiazol-6-yl)phenyl]furan-2-carboxamide MLS000050448 cid_2953653
Type:
Small organic molecule
Emp. Form.:
C21H13Cl2N5O2S
Mol. Mass.:
470.331
SMILES:
Cc1nnc2sc(nn12)-c1ccc(NC(=O)c2ccc(o2)-c2ccc(Cl)cc2Cl)cc1
: