Target
Tyrosine-protein phosphatase non-receptor type 11
Ligand
BDBM88776
Substrate
Meas. Tech.
Dose Response selectivity of inhibitors of Striatal-Enriched Phosphatase (STEP) in a SHP2 (PTPN11) Inhibition Assay
IC50
3240±n/a nM
Citation
 PubChem, PC Dose Response selectivity of inhibitors of Striatal-Enriched Phosphatase (STEP) in a SHP2 (PTPN11) Inhibition Assay PubChem Bioassay (2012)[AID] 
Target
Name:
Tyrosine-protein phosphatase non-receptor type 11
Synonyms:
PTN11_HUMAN PTP-2C PTPN11 Protein tyrosine phosphatase (PTP) Shp2 Protein-tyrosine phosphatase 2C SHP2 Src homology phosphatase 2 (SHP-2) Tyrosine-protein phosphatase non-receptor type 11 (PTPN11) Tyrosine-protein phosphatase non-receptor type 11 (SHP2)
Type:
Protein phosphatase
Mol. Mass.:
68443.59
Organism:
Homo sapiens (Human)
Description:
Q06124
Residue:
597
  
Inhibitor
Name:
BDBM88776
Synonyms:
2-[4-[(Z)-[5-(4-chlorophenyl)-6-isopropoxycarbonyl-3-keto-7-methyl-5H-thiazolo[3,2-a]pyrimidin-2-ylidene]methyl]phenoxy]acetic acid 2-[4-[(Z)-[5-(4-chlorophenyl)-7-methyl-3-oxo-6-[oxo(propan-2-yloxy)methyl]-5H-thiazolo[3,2-a]pyrimidin-2-ylidene]methyl]phenoxy]acetic acid MLS001178474 cid_5777336 | {4-[(5-(4-chlorophenyl)-6-(isopropoxycarbonyl)-7-methyl-3-oxo-5H-[1,3]thiazolo[3,2-a]pyrimidin-2(3H)-ylidene)methyl]phenoxy}acetic acid
Type:
Small organic molecule
Emp. Form.:
C26H23ClN2O6S
Mol. Mass.:
526.989
SMILES:
CC(C)OC(=O)C1=C(C)N=c2s\c(=C/c3ccc(OCC(O)=O)cc3)c(=O)n2C1c1ccc(Cl)cc1
: