Target
Tyrosine-protein phosphatase non-receptor type 11
Ligand
BDBM59546
Substrate
Meas. Tech.
Dose Response selectivity of inhibitors of Striatal-Enriched Phosphatase (STEP) in a SHP2 (PTPN11) Inhibition Assay
IC50
1550±n/a nM
Citation
 PubChem, PC Dose Response selectivity of inhibitors of Striatal-Enriched Phosphatase (STEP) in a SHP2 (PTPN11) Inhibition Assay PubChem Bioassay (2012)[AID] 
Target
Name:
Tyrosine-protein phosphatase non-receptor type 11
Synonyms:
PTN11_HUMAN PTP-2C PTPN11 Protein tyrosine phosphatase (PTP) Shp2 Protein-tyrosine phosphatase 2C SHP2 Src homology phosphatase 2 (SHP-2) Tyrosine-protein phosphatase non-receptor type 11 (PTPN11) Tyrosine-protein phosphatase non-receptor type 11 (SHP2)
Type:
Protein phosphatase
Mol. Mass.:
68443.59
Organism:
Homo sapiens (Human)
Description:
Q06124
Residue:
597
  
Inhibitor
Name:
BDBM59546
Synonyms:
3-[7-(2-chlorobenzyl)oxy-2-keto-4,8-dimethyl-chromen-3-yl]propionic acid 3-[7-[(2-chlorophenyl)methoxy]-4,8-dimethyl-2-oxo-1-benzopyran-3-yl]propanoic acid MLS001213288 cid_1801772
Type:
Small organic molecule
Emp. Form.:
C21H19ClO5
Mol. Mass.:
386.826
SMILES:
Cc1c(OCc2ccccc2Cl)ccc2c(C)c(CCC(O)=O)c(=O)oc12
: