Target
Tyrosine-protein phosphatase non-receptor type 11
Ligand
BDBM88788
Substrate
Meas. Tech.
Dose Response selectivity of inhibitors of Striatal-Enriched Phosphatase (STEP) in a SHP2 (PTPN11) Inhibition Assay
IC50
4480±n/a nM
Citation
 PubChem, PC Dose Response selectivity of inhibitors of Striatal-Enriched Phosphatase (STEP) in a SHP2 (PTPN11) Inhibition Assay PubChem Bioassay (2012)[AID] 
Target
Name:
Tyrosine-protein phosphatase non-receptor type 11
Synonyms:
PTN11_HUMAN PTP-2C PTPN11 Protein tyrosine phosphatase (PTP) Shp2 Protein-tyrosine phosphatase 2C SHP2 Src homology phosphatase 2 (SHP-2) Tyrosine-protein phosphatase non-receptor type 11 (PTPN11) Tyrosine-protein phosphatase non-receptor type 11 (SHP2)
Type:
Protein phosphatase
Mol. Mass.:
68443.59
Organism:
Homo sapiens (Human)
Description:
Q06124
Residue:
597
  
Inhibitor
Name:
BDBM88788
Synonyms:
(4Z)-1-(3-bromophenyl)-4-(4-morpholin-4-ylbenzylidene)pyrazolidine-3,5-dione (4Z)-1-(3-bromophenyl)-4-[(4-morpholin-4-ylphenyl)methylidene]pyrazolidine-3,5-dione MLS001194678 cid_1921067
Type:
Small organic molecule
Emp. Form.:
C20H18BrN3O3
Mol. Mass.:
428.279
SMILES:
Brc1cccc(c1)N1NC(=O)\C(=C\c2ccc(cc2)N2CCOCC2)C1=O
: