Target
Tyrosine-protein phosphatase non-receptor type 11
Ligand
BDBM88796
Substrate
Meas. Tech.
Dose Response selectivity of inhibitors of Striatal-Enriched Phosphatase (STEP) in a SHP2 (PTPN11) Inhibition Assay
IC50
1970±n/a nM
Citation
 PubChem, PC Dose Response selectivity of inhibitors of Striatal-Enriched Phosphatase (STEP) in a SHP2 (PTPN11) Inhibition Assay PubChem Bioassay (2012)[AID] 
Target
Name:
Tyrosine-protein phosphatase non-receptor type 11
Synonyms:
PTN11_HUMAN PTP-2C PTPN11 Protein tyrosine phosphatase (PTP) Shp2 Protein-tyrosine phosphatase 2C SHP2 Src homology phosphatase 2 (SHP-2) Tyrosine-protein phosphatase non-receptor type 11 (PTPN11) Tyrosine-protein phosphatase non-receptor type 11 (SHP2)
Type:
Protein phosphatase
Mol. Mass.:
68443.59
Organism:
Homo sapiens (Human)
Description:
Q06124
Residue:
597
  
Inhibitor
Name:
BDBM88796
Synonyms:
MLS001110505 N-(2-chloro-4-methyl-phenyl)-2-morpholino-1,3-benzothiazole-6-carboxamide N-(2-chloro-4-methylphenyl)-2-morpholin-4-yl-1,3-benzothiazole-6-carboxamide cid_24793673
Type:
Small organic molecule
Emp. Form.:
C19H18ClN3O2S
Mol. Mass.:
387.883
SMILES:
Cc1ccc(NC(=O)c2ccc3nc(sc3c2)N2CCOCC2)c(Cl)c1
: