Target
Tyrosine-protein phosphatase non-receptor type 11
Ligand
BDBM88805
Substrate
Meas. Tech.
Dose Response selectivity of inhibitors of Striatal-Enriched Phosphatase (STEP) in a SHP2 (PTPN11) Inhibition Assay
IC50
5470±n/a nM
Citation
 PubChem, PC Dose Response selectivity of inhibitors of Striatal-Enriched Phosphatase (STEP) in a SHP2 (PTPN11) Inhibition Assay PubChem Bioassay (2012)[AID] 
Target
Name:
Tyrosine-protein phosphatase non-receptor type 11
Synonyms:
PTN11_HUMAN PTP-2C PTPN11 Protein tyrosine phosphatase (PTP) Shp2 Protein-tyrosine phosphatase 2C SHP2 Src homology phosphatase 2 (SHP-2) Tyrosine-protein phosphatase non-receptor type 11 (PTPN11) Tyrosine-protein phosphatase non-receptor type 11 (SHP2)
Type:
Protein phosphatase
Mol. Mass.:
68443.59
Organism:
Homo sapiens (Human)
Description:
Q06124
Residue:
597
  
Inhibitor
Name:
BDBM88805
Synonyms:
MLS002179739 N-(5-chloro-2-pyridinyl)-2-[(5,6-dimethyl-4-oxo-3H-thieno[2,3-d]pyrimidin-2-yl)methylthio]propanamide N-(5-chloropyridin-2-yl)-2-[(5,6-dimethyl-4-oxo-3H-thieno[2,3-d]pyrimidin-2-yl)methylsulfanyl]propanamide cid_25162023
Type:
Small organic molecule
Emp. Form.:
C17H17ClN4O2S2
Mol. Mass.:
408.925
SMILES:
CC(SCc1nc2sc(C)c(C)c2c(=O)[nH]1)C(=O)Nc1ccc(Cl)cn1
: