Target
Tyrosine-protein phosphatase non-receptor type 11
Ligand
BDBM88811
Substrate
Meas. Tech.
Dose Response selectivity of inhibitors of Striatal-Enriched Phosphatase (STEP) in a SHP2 (PTPN11) Inhibition Assay
IC50
1450±n/a nM
Citation
 PubChem, PC Dose Response selectivity of inhibitors of Striatal-Enriched Phosphatase (STEP) in a SHP2 (PTPN11) Inhibition Assay PubChem Bioassay (2012)[AID] 
Target
Name:
Tyrosine-protein phosphatase non-receptor type 11
Synonyms:
PTN11_HUMAN PTP-2C PTPN11 Protein tyrosine phosphatase (PTP) Shp2 Protein-tyrosine phosphatase 2C SHP2 Src homology phosphatase 2 (SHP-2) Tyrosine-protein phosphatase non-receptor type 11 (PTPN11) Tyrosine-protein phosphatase non-receptor type 11 (SHP2)
Type:
Protein phosphatase
Mol. Mass.:
68443.59
Organism:
Homo sapiens (Human)
Description:
Q06124
Residue:
597
  
Inhibitor
Name:
BDBM88811
Synonyms:
(2,3,4,5-tetrachlorocyclopenta-2,4-dien-1-ylidene)hydrazine 2,3,4,5-tetrachlorocyclopenta-2,4-dien-1-one hydrazone SMR001797483 cid_277512
Type:
Small organic molecule
Emp. Form.:
C5H2Cl4N2
Mol. Mass.:
231.895
SMILES:
[#7]\[#7]=[#6]-1\[#6](Cl)=[#6](Cl)-[#6](Cl)=[#6]-1Cl
: