Target
26S proteasome non-ATPase regulatory subunit 14
Ligand
BDBM60303
Substrate
Meas. Tech.
Dose response confirmation of uHTS RPN11 inhibitor hits in a Fluorescence Polarization assay
IC50
6710±466 nM
Citation
 PubChem, PC Dose response confirmation of uHTS RPN11 inhibitor hits in a Fluorescence Polarization assay PubChem Bioassay (2012)[AID] 
Target
Name:
26S proteasome non-ATPase regulatory subunit 14
Synonyms:
26S Proteasome regulatory subunit Rpn11 (Rpn11) PSDE_HUMAN PSMD14 protein
Type:
Protein
Mol. Mass.:
34576.68
Organism:
Homo sapiens (Human)
Description:
O00487
Residue:
310
  
Inhibitor
Name:
BDBM60303
Synonyms:
4-phenyl-N-[4-[(4-sulfamoylphenyl)sulfamoyl]phenyl]benzamide N-(4-{[4-(aminosulfonyl)anilino]sulfonyl}phenyl)[1,1'-biphenyl]-4-carboxamide cid_1789702
Type:
Small organic molecule
Emp. Form.:
C25H21N3O5S2
Mol. Mass.:
507.581
SMILES:
NS(=O)(=O)c1ccc(NS(=O)(=O)c2ccc(NC(=O)c3ccc(cc3)-c3ccccc3)cc2)cc1
: