Target
26S proteasome non-ATPase regulatory subunit 14
Ligand
BDBM60483
Substrate
Meas. Tech.
Dose response confirmation of uHTS RPN11 inhibitor hits in a Fluorescence Polarization assay
IC50
2180±303 nM
Citation
 PubChem, PC Dose response confirmation of uHTS RPN11 inhibitor hits in a Fluorescence Polarization assay PubChem Bioassay (2012)[AID] 
Target
Name:
26S proteasome non-ATPase regulatory subunit 14
Synonyms:
26S Proteasome regulatory subunit Rpn11 (Rpn11) PSDE_HUMAN PSMD14 protein
Type:
Protein
Mol. Mass.:
34576.68
Organism:
Homo sapiens (Human)
Description:
O00487
Residue:
310
  
Inhibitor
Name:
BDBM60483
Synonyms:
(5Z)-5-(4-hydroxy-3,5-dimethoxy-benzylidene)-2-(p-tolyl)-2-thiazolin-4-one (5Z)-5-[(4-hydroxy-3,5-dimethoxyphenyl)methylidene]-2-(4-methylphenyl)-1,3-thiazol-4-one 5-(4-hydroxy-3,5-dimethoxybenzylidene)-2-(4-methylphenyl)-1,3-thiazol-4(5H)-one SMR000186528 | cid_2253255
Type:
Small organic molecule
Emp. Form.:
C19H17NO4S
Mol. Mass.:
355.408
SMILES:
COc1cc(\C=C2/SC(=NC2=O)c2ccc(C)cc2)cc(OC)c1O
: