Target
26S proteasome non-ATPase regulatory subunit 14
Ligand
BDBM41095
Substrate
Meas. Tech.
Dose response confirmation of uHTS RPN11 inhibitor hits in a Fluorescence Polarization assay
IC50
4930±353 nM
Citation
 PubChem, PC Dose response confirmation of uHTS RPN11 inhibitor hits in a Fluorescence Polarization assay PubChem Bioassay (2012)[AID] 
Target
Name:
26S proteasome non-ATPase regulatory subunit 14
Synonyms:
26S Proteasome regulatory subunit Rpn11 (Rpn11) PSDE_HUMAN PSMD14 protein
Type:
Protein
Mol. Mass.:
34576.68
Organism:
Homo sapiens (Human)
Description:
O00487
Residue:
310
  
Inhibitor
Name:
BDBM41095
Synonyms:
5-[[4-[(E)-2-(1H-benzimidazol-2-yl)-2-cyano-vinyl]-2-methoxy-phenoxy]methyl]furan-2-carboxylic acid methyl ester MLS000581749 cid_5740525 methyl 5-[[4-[(E)-2-(1H-benzimidazol-2-yl)-2-cyano-ethenyl]-2-methoxy-phenoxy]methyl]furan-2-carboxylate | methyl 5-[[4-[(E)-2-(1H-benzimidazol-2-yl)-2-cyanoethenyl]-2-methoxyphenoxy]methyl]furan-2-carboxylate
Type:
Small organic molecule
Emp. Form.:
C24H19N3O5
Mol. Mass.:
429.4248
SMILES:
COC(=O)c1ccc(COc2ccc(\C=C(/C#N)c3nc4ccccc4[nH]3)cc2OC)o1
: