Target
26S proteasome non-ATPase regulatory subunit 14
Ligand
BDBM29677
Substrate
Meas. Tech.
Dose response confirmation of uHTS RPN11 inhibitor hits in a Fluorescence Polarization assay
IC50
4760±553 nM
Citation
 PubChem, PC Dose response confirmation of uHTS RPN11 inhibitor hits in a Fluorescence Polarization assay PubChem Bioassay (2012)[AID] 
Target
Name:
26S proteasome non-ATPase regulatory subunit 14
Synonyms:
26S Proteasome regulatory subunit Rpn11 (Rpn11) PSDE_HUMAN PSMD14 protein
Type:
Protein
Mol. Mass.:
34576.68
Organism:
Homo sapiens (Human)
Description:
O00487
Residue:
310
  
Inhibitor
Name:
BDBM29677
Synonyms:
(3E)-3-(2-furanylmethylidene)-1,2-dihydrocyclopenta[b]quinoline-9-carboxylic acid [2-[2-cyanoethyl(methyl)amino]-2-oxoethyl] ester MLS000335532 [2-[2-cyanoethyl(methyl)amino]-2-oxidanylidene-ethyl] (3E)-3-(furan-2-ylmethylidene)-1,2-dihydrocyclopenta[b]quinoline-9-carboxylate cid_5801934
Type:
Small organic molecule
Emp. Form.:
C24H21N3O4
Mol. Mass.:
415.4412
SMILES:
CN(CCC#N)C(=O)COC(=O)c1c2CC\C(=C/c3ccco3)c2nc2ccccc12
: