Target
26S proteasome non-ATPase regulatory subunit 14
Ligand
BDBM51120
Substrate
Meas. Tech.
Dose response confirmation of uHTS RPN11 inhibitor hits in a Fluorescence Polarization assay
IC50
8120±645 nM
Citation
 PubChem, PC Dose response confirmation of uHTS RPN11 inhibitor hits in a Fluorescence Polarization assay PubChem Bioassay (2012)[AID] 
Target
Name:
26S proteasome non-ATPase regulatory subunit 14
Synonyms:
26S Proteasome regulatory subunit Rpn11 (Rpn11) PSDE_HUMAN PSMD14 protein
Type:
Protein
Mol. Mass.:
34576.68
Organism:
Homo sapiens (Human)
Description:
O00487
Residue:
310
  
Inhibitor
Name:
BDBM51120
Synonyms:
4-phenyl-N-(4-sulfamoylphenyl)benzamide SMR000273960 | cid_1381590
Type:
Small organic molecule
Emp. Form.:
C19H16N2O3S
Mol. Mass.:
352.407
SMILES:
NS(=O)(=O)c1ccc(NC(=O)c2ccc(cc2)-c2ccccc2)cc1
: