Target
Prothrombin
Ligand
BDBM88839
Substrate
Meas. Tech.
Dose Response validation of uHTS RPN11 inhibitor hits using a Thrombin Fluorescence Polarization assay
IC50
7220±941 nM
Citation
 PubChem, PC Dose Response validation of uHTS RPN11 inhibitor hits using a Thrombin Fluorescence Polarization assay PubChem Bioassay (2012)[AID] 
Target
Name:
Prothrombin
Synonyms:
Activation peptide fragment 1 Coagulation factor II Prothrombin Thrombin Thrombin light chain
Type:
Enzyme
Mol. Mass.:
70502.73
Organism:
Bos taurus (Bovine)
Description:
P00735
Residue:
625
  
Inhibitor
Name:
BDBM88839
Synonyms:
(4Z)-4-[(2-methyl-1H-indol-3-yl)methylene]-2-phenyl-2-oxazolin-5-one (4Z)-4-[(2-methyl-1H-indol-3-yl)methylidene]-2-phenyl-5-oxazolone SMR000155333 | cid_5397501
Type:
Small organic molecule
Emp. Form.:
C19H14N2O2
Mol. Mass.:
302.3267
SMILES:
Cc1[nH]c2ccccc2c1\C=C1/N=C(OC1=O)c1ccccc1
: