Target
Prothrombin
Ligand
BDBM49575
Substrate
Meas. Tech.
Dose Response validation of uHTS RPN11 inhibitor hits using a Thrombin Fluorescence Polarization assay
IC50
9840±2160 nM
Citation
 PubChem, PC Dose Response validation of uHTS RPN11 inhibitor hits using a Thrombin Fluorescence Polarization assay PubChem Bioassay (2012)[AID] 
Target
Name:
Prothrombin
Synonyms:
Activation peptide fragment 1 Coagulation factor II Prothrombin Thrombin Thrombin light chain
Type:
Enzyme
Mol. Mass.:
70502.73
Organism:
Bos taurus (Bovine)
Description:
P00735
Residue:
625
  
Inhibitor
Name:
BDBM49575
Synonyms:
1-(4-nitrophenyl)-2-[(Z)-2-pyrrolylidenemethyl]hydrazine 1-(4-nitrophenyl)-2-[(Z)-pyrrol-2-ylidenemethyl]hydrazine MLS000595102 cid_5718774
Type:
Small organic molecule
Emp. Form.:
C11H10N4O2
Mol. Mass.:
230.2227
SMILES:
[O-][N+](=O)c1ccc(cc1)N=[NH+]Cc1ccc[n-]1
: