Target
Prothrombin
Ligand
BDBM89017
Substrate
Meas. Tech.
Dose Response validation of uHTS RPN11 inhibitor hits using a Thrombin Fluorescence Polarization assay
IC50
5110±759 nM
Citation
 PubChem, PC Dose Response validation of uHTS RPN11 inhibitor hits using a Thrombin Fluorescence Polarization assay PubChem Bioassay (2012)[AID] 
Target
Name:
Prothrombin
Synonyms:
Activation peptide fragment 1 Coagulation factor II Prothrombin Thrombin Thrombin light chain
Type:
Enzyme
Mol. Mass.:
70502.73
Organism:
Bos taurus (Bovine)
Description:
P00735
Residue:
625
  
Inhibitor
Name:
BDBM89017
Synonyms:
(4-aminophenyl)-diethyl-amine MLS002454419 N4,N4-diethylbenzene-1,4-diamine cid_7120
Type:
Small organic molecule
Emp. Form.:
C10H16N2
Mol. Mass.:
164.2474
SMILES:
CCN(CC)c1ccc(N)cc1
: