Target
Tyrosine-protein phosphatase non-receptor type 5
Ligand
BDBM41052
Substrate
Meas. Tech.
Dose response confirmation of uHTS small molecule inhibitors of Striatal-Enriched Phosphatase via a fluorescence intensity assay
IC50
42300±n/a nM
Citation
 PubChem, PC Dose response confirmation of uHTS small molecule inhibitors of Striatal-Enriched Phosphatase via a fluorescence intensity assay PubChem Bioassay (2012)[AID] 
Target
Name:
Tyrosine-protein phosphatase non-receptor type 5
Synonyms:
PTN5_HUMAN Tyrosine-protein phosphatase non-receptor type 5 | Tyrosine-protein phosphatase non-receptor type 5 isoform a
Type:
Enzyme Catalytic Domain
Mol. Mass.:
63510.68
Organism:
Homo sapiens (Human)
Description:
gi_90652859
Residue:
565
  
Inhibitor
Name:
BDBM41052
Synonyms:
3-(3-chloranyl-4-methoxy-phenyl)-4-oxidanylidene-N-[2-oxidanylidene-2-(pyridin-2-ylamino)ethyl]phthalazine-1-carboxamide 3-(3-chloro-4-methoxyphenyl)-4-oxo-N-[2-oxo-2-(2-pyridinylamino)ethyl]-1-phthalazinecarboxamide MLS000519682 cid_11957249
Type:
Small organic molecule
Emp. Form.:
C23H18ClN5O4
Mol. Mass.:
463.873
SMILES:
COc1ccc(cc1Cl)-n1nc(C(=O)NCC(=O)Nc2ccccn2)c2ccccc2c1=O
: