Target
Tyrosine-protein phosphatase non-receptor type 5
Ligand
BDBM46206
Substrate
Meas. Tech.
Dose response confirmation of uHTS small molecule inhibitors of Striatal-Enriched Phosphatase via a fluorescence intensity assay
IC50
17000±n/a nM
Citation
 PubChem, PC Dose response confirmation of uHTS small molecule inhibitors of Striatal-Enriched Phosphatase via a fluorescence intensity assay PubChem Bioassay (2012)[AID] 
Target
Name:
Tyrosine-protein phosphatase non-receptor type 5
Synonyms:
PTN5_HUMAN Tyrosine-protein phosphatase non-receptor type 5 | Tyrosine-protein phosphatase non-receptor type 5 isoform a
Type:
Enzyme Catalytic Domain
Mol. Mass.:
63510.68
Organism:
Homo sapiens (Human)
Description:
gi_90652859
Residue:
565
  
Inhibitor
Name:
BDBM46206
Synonyms:
MLS-0109562.0001 [1-(2-phenoxyethyl)indol-3-yl]-pyrrolidin-1-yl-methanethione [1-(2-phenoxyethyl)indol-3-yl]-pyrrolidino-methanethione | cid_1324805
Type:
Small organic molecule
Emp. Form.:
C21H22N2OS
Mol. Mass.:
350.477
SMILES:
S=C(N1CCCC1)c1cn(CCOc2ccccc2)c2ccccc12
: