Target
Tyrosine-protein phosphatase non-receptor type 5
Ligand
BDBM88751
Substrate
Meas. Tech.
Dose response confirmation of uHTS small molecule inhibitors of Striatal-Enriched Phosphatase via a fluorescence intensity assay
IC50
>80000±n/a nM
Citation
 PubChem, PC Dose response confirmation of uHTS small molecule inhibitors of Striatal-Enriched Phosphatase via a fluorescence intensity assay PubChem Bioassay (2012)[AID] 
Target
Name:
Tyrosine-protein phosphatase non-receptor type 5
Synonyms:
PTN5_HUMAN Tyrosine-protein phosphatase non-receptor type 5 | Tyrosine-protein phosphatase non-receptor type 5 isoform a
Type:
Enzyme Catalytic Domain
Mol. Mass.:
63510.68
Organism:
Homo sapiens (Human)
Description:
gi_90652859
Residue:
565
  
Inhibitor
Name:
BDBM88751
Synonyms:
MLS000662592 N-(4-chloro-2,5-dimethoxy-phenyl)-4-methyl-piperazine-1-carbothioamide N-(4-chloro-2,5-dimethoxyphenyl)-4-methylpiperazine-1-carbothioamide cid_891883
Type:
Small organic molecule
Emp. Form.:
C14H20ClN3O2S
Mol. Mass.:
329.846
SMILES:
COc1cc(NC(=S)N2CCN(C)CC2)c(OC)cc1Cl
: