Target
Tyrosine-protein phosphatase non-receptor type 5
Ligand
BDBM88754
Substrate
Meas. Tech.
Dose response confirmation of uHTS small molecule inhibitors of Striatal-Enriched Phosphatase via a fluorescence intensity assay
IC50
2730±n/a nM
Citation
 PubChem, PC Dose response confirmation of uHTS small molecule inhibitors of Striatal-Enriched Phosphatase via a fluorescence intensity assay PubChem Bioassay (2012)[AID] 
Target
Name:
Tyrosine-protein phosphatase non-receptor type 5
Synonyms:
PTN5_HUMAN Tyrosine-protein phosphatase non-receptor type 5 | Tyrosine-protein phosphatase non-receptor type 5 isoform a
Type:
Enzyme Catalytic Domain
Mol. Mass.:
63510.68
Organism:
Homo sapiens (Human)
Description:
gi_90652859
Residue:
565
  
Inhibitor
Name:
BDBM88754
Synonyms:
MLS000401595 N-[3-[(2-methoxyphenyl)sulfamoyl]-4-pyrrolidin-1-yl-phenyl]-3-methyl-thiophene-2-carboxamide N-[3-[(2-methoxyphenyl)sulfamoyl]-4-pyrrolidino-phenyl]-3-methyl-thiophene-2-carboxamide cid_3457783
Type:
Small organic molecule
Emp. Form.:
C23H25N3O4S2
Mol. Mass.:
471.592
SMILES:
COc1ccccc1NS(=O)(=O)c1cc(NC(=O)c2sccc2C)ccc1N1CCCC1
: