Target
Tyrosine-protein phosphatase non-receptor type 5
Ligand
BDBM51774
Substrate
Meas. Tech.
Dose response confirmation of uHTS small molecule inhibitors of Striatal-Enriched Phosphatase via a fluorescence intensity assay
IC50
11600±n/a nM
Citation
 PubChem, PC Dose response confirmation of uHTS small molecule inhibitors of Striatal-Enriched Phosphatase via a fluorescence intensity assay PubChem Bioassay (2012)[AID] 
Target
Name:
Tyrosine-protein phosphatase non-receptor type 5
Synonyms:
PTN5_HUMAN Tyrosine-protein phosphatase non-receptor type 5 | Tyrosine-protein phosphatase non-receptor type 5 isoform a
Type:
Enzyme Catalytic Domain
Mol. Mass.:
63510.68
Organism:
Homo sapiens (Human)
Description:
gi_90652859
Residue:
565
  
Inhibitor
Name:
BDBM51774
Synonyms:
1'-({[4-(aminosulfonyl)phenyl]amino}carbonothioyl)-1,4'-bipiperidine-4'-carboxamide 4-piperidin-1-yl-1-[(4-sulfamoylphenyl)carbamothioyl]piperidine-4-carboxamide MLS000621463 cid_2193503
Type:
Small organic molecule
Emp. Form.:
C18H27N5O3S2
Mol. Mass.:
425.569
SMILES:
NC(=O)C1(CCN(CC1)C(=S)Nc1ccc(cc1)S(N)(=O)=O)N1CCCCC1
: