Target
Tyrosine-protein phosphatase non-receptor type 5
Ligand
BDBM51777
Substrate
Meas. Tech.
Dose response confirmation of uHTS small molecule inhibitors of Striatal-Enriched Phosphatase via a fluorescence intensity assay
IC50
3970±n/a nM
Citation
 PubChem, PC Dose response confirmation of uHTS small molecule inhibitors of Striatal-Enriched Phosphatase via a fluorescence intensity assay PubChem Bioassay (2012)[AID] 
Target
Name:
Tyrosine-protein phosphatase non-receptor type 5
Synonyms:
PTN5_HUMAN Tyrosine-protein phosphatase non-receptor type 5 | Tyrosine-protein phosphatase non-receptor type 5 isoform a
Type:
Enzyme Catalytic Domain
Mol. Mass.:
63510.68
Organism:
Homo sapiens (Human)
Description:
gi_90652859
Residue:
565
  
Inhibitor
Name:
BDBM51777
Synonyms:
3-[7-[(6-chloranyl-1,3-benzodioxol-5-yl)methoxy]-4,8-dimethyl-2-oxidanylidene-chromen-3-yl]propanoic acid 3-[7-[(6-chloro-1,3-benzodioxol-5-yl)methoxy]-4,8-dimethyl-2-oxo-1-benzopyran-3-yl]propanoic acid 3-{7-[(6-chloro-1,3-benzodioxol-5-yl)methoxy]-4,8-dimethyl-2-oxo-2H-chromen-3-yl}propanoic acid SMR000300092 | cid_1800867
Type:
Small organic molecule
Emp. Form.:
C22H19ClO7
Mol. Mass.:
430.835
SMILES:
Cc1c(OCc2cc3OCOc3cc2Cl)ccc2c(C)c(CCC(O)=O)c(=O)oc12
: