Target
Tyrosine-protein phosphatase non-receptor type 5
Ligand
BDBM88763
Substrate
Meas. Tech.
Dose response confirmation of uHTS small molecule inhibitors of Striatal-Enriched Phosphatase via a fluorescence intensity assay
IC50
8160±n/a nM
Citation
 PubChem, PC Dose response confirmation of uHTS small molecule inhibitors of Striatal-Enriched Phosphatase via a fluorescence intensity assay PubChem Bioassay (2012)[AID] 
Target
Name:
Tyrosine-protein phosphatase non-receptor type 5
Synonyms:
PTN5_HUMAN Tyrosine-protein phosphatase non-receptor type 5 | Tyrosine-protein phosphatase non-receptor type 5 isoform a
Type:
Enzyme Catalytic Domain
Mol. Mass.:
63510.68
Organism:
Homo sapiens (Human)
Description:
gi_90652859
Residue:
565
  
Inhibitor
Name:
BDBM88763
Synonyms:
4-bromanyl-N-[(E)-(3-nitrophenyl)methylideneamino]benzamide 4-bromo-N-[(E)-(3-nitrophenyl)methylideneamino]benzamide SMR000279123 | cid_6870879
Type:
Small organic molecule
Emp. Form.:
C14H10BrN3O3
Mol. Mass.:
348.152
SMILES:
[O-][N+](=O)c1cccc(\C=N\NC(=O)c2ccc(Br)cc2)c1
: