Target
Tyrosine-protein phosphatase non-receptor type 5
Ligand
BDBM88788
Substrate
Meas. Tech.
Dose response confirmation of uHTS small molecule inhibitors of Striatal-Enriched Phosphatase via a fluorescence intensity assay
IC50
21300±n/a nM
Citation
 PubChem, PC Dose response confirmation of uHTS small molecule inhibitors of Striatal-Enriched Phosphatase via a fluorescence intensity assay PubChem Bioassay (2012)[AID] 
Target
Name:
Tyrosine-protein phosphatase non-receptor type 5
Synonyms:
PTN5_HUMAN Tyrosine-protein phosphatase non-receptor type 5 | Tyrosine-protein phosphatase non-receptor type 5 isoform a
Type:
Enzyme Catalytic Domain
Mol. Mass.:
63510.68
Organism:
Homo sapiens (Human)
Description:
gi_90652859
Residue:
565
  
Inhibitor
Name:
BDBM88788
Synonyms:
(4Z)-1-(3-bromophenyl)-4-(4-morpholin-4-ylbenzylidene)pyrazolidine-3,5-dione (4Z)-1-(3-bromophenyl)-4-[(4-morpholin-4-ylphenyl)methylidene]pyrazolidine-3,5-dione MLS001194678 cid_1921067
Type:
Small organic molecule
Emp. Form.:
C20H18BrN3O3
Mol. Mass.:
428.279
SMILES:
Brc1cccc(c1)N1NC(=O)\C(=C\c2ccc(cc2)N2CCOCC2)C1=O
: