Target
Tyrosine-protein phosphatase non-receptor type 5
Ligand
BDBM88801
Substrate
Meas. Tech.
Dose response confirmation of uHTS small molecule inhibitors of Striatal-Enriched Phosphatase via a fluorescence intensity assay
IC50
12800±n/a nM
Citation
 PubChem, PC Dose response confirmation of uHTS small molecule inhibitors of Striatal-Enriched Phosphatase via a fluorescence intensity assay PubChem Bioassay (2012)[AID] 
Target
Name:
Tyrosine-protein phosphatase non-receptor type 5
Synonyms:
PTN5_HUMAN Tyrosine-protein phosphatase non-receptor type 5 | Tyrosine-protein phosphatase non-receptor type 5 isoform a
Type:
Enzyme Catalytic Domain
Mol. Mass.:
63510.68
Organism:
Homo sapiens (Human)
Description:
gi_90652859
Residue:
565
  
Inhibitor
Name:
BDBM88801
Synonyms:
2-hydroxy-N-[(E)-1-[4-[(1-oxo-2-phenylethyl)amino]phenyl]ethylideneamino]benzamide 2-oxidanyl-N-[(E)-1-[4-(2-phenylethanoylamino)phenyl]ethylideneamino]benzamide SMR000679040 | cid_25237596
Type:
Small organic molecule
Emp. Form.:
C23H21N3O3
Mol. Mass.:
387.4311
SMILES:
CC(=NNC(=O)c1ccccc1O)c1ccc(NC(=O)Cc2ccccc2)cc1
: