Target
Tyrosine-protein phosphatase non-receptor type 5
Ligand
BDBM84008
Substrate
Meas. Tech.
Dose response confirmation of uHTS small molecule inhibitors of Striatal-Enriched Phosphatase via a fluorescence intensity assay
IC50
4120±n/a nM
Citation
 PubChem, PC Dose response confirmation of uHTS small molecule inhibitors of Striatal-Enriched Phosphatase via a fluorescence intensity assay PubChem Bioassay (2012)[AID] 
Target
Name:
Tyrosine-protein phosphatase non-receptor type 5
Synonyms:
PTN5_HUMAN Tyrosine-protein phosphatase non-receptor type 5 | Tyrosine-protein phosphatase non-receptor type 5 isoform a
Type:
Enzyme Catalytic Domain
Mol. Mass.:
63510.68
Organism:
Homo sapiens (Human)
Description:
gi_90652859
Residue:
565
  
Inhibitor
Name:
BDBM84008
Synonyms:
2-[[4-[2-[(4-methylsulfanylphenyl)methylidene]hydrazinyl]-3-nitro-phenyl]sulfonylamino]benzoic acid 2-[[4-[2-[[4-(methylthio)phenyl]methylidene]hydrazinyl]-3-nitrophenyl]sulfonylamino]benzoic acid MLS002245633 cid_3292268
Type:
Small organic molecule
Emp. Form.:
C21H18N4O6S2
Mol. Mass.:
486.521
SMILES:
CSc1ccc(CN=Nc2ccc(cc2[N+]([O-])=O)S(=O)(=O)Nc2ccccc2C(O)=O)cc1
: