Target
Dual specificity protein phosphatase 3
Ligand
BDBM80129
Substrate
Meas. Tech.
Dose Response selectivity of inhibitors of STriatal-Enriched Phosphatase (STEP) in the dual-specificity protein-tyrosine phosphatase VHR Inhibition Assay
IC50
341±n/a nM
Citation
 PubChem, PC Dose Response selectivity of inhibitors of STriatal-Enriched Phosphatase (STEP) in the dual-specificity protein-tyrosine phosphatase VHR Inhibition Assay PubChem Bioassay (2012)[AID] 
Target
Name:
Dual specificity protein phosphatase 3
Synonyms:
DUS3_HUMAN Dual specificity protein phosphatase (VHR) Dual specificity protein phosphatase VHR Tyrosine-protein phosphatase non-receptor type 1 | VHR
Type:
Hydrolase
Mol. Mass.:
20480.58
Organism:
Homo sapiens (Human)
Description:
Residue:
185
  
Inhibitor
Name:
BDBM80129
Synonyms:
(4-chlorophenyl)-(4-ethyl-1-piperazinyl)methanethione (4-chlorophenyl)-(4-ethylpiperazino)methanethione MLS000594090 cid_888688
Type:
Small organic molecule
Emp. Form.:
C13H17ClN2S
Mol. Mass.:
268.805
SMILES:
CCN1CCN(CC1)C(=S)c1ccc(Cl)cc1
: