Target
Dual specificity protein phosphatase 3
Ligand
BDBM88731
Substrate
Meas. Tech.
Dose Response selectivity of inhibitors of STriatal-Enriched Phosphatase (STEP) in the dual-specificity protein-tyrosine phosphatase VHR Inhibition Assay
IC50
567±n/a nM
Citation
 PubChem, PC Dose Response selectivity of inhibitors of STriatal-Enriched Phosphatase (STEP) in the dual-specificity protein-tyrosine phosphatase VHR Inhibition Assay PubChem Bioassay (2012)[AID] 
Target
Name:
Dual specificity protein phosphatase 3
Synonyms:
DUS3_HUMAN Dual specificity protein phosphatase (VHR) Dual specificity protein phosphatase VHR Tyrosine-protein phosphatase non-receptor type 1 | VHR
Type:
Hydrolase
Mol. Mass.:
20480.58
Organism:
Homo sapiens (Human)
Description:
Residue:
185
  
Inhibitor
Name:
BDBM88731
Synonyms:
3-[[5-(1-ethylpropyl)-1,3,4-thiadiazol-2-yl]carbamoyl]-5-nitro-benzoic acid methyl ester MLS000579956 cid_2162931 methyl 3-nitro-5-[(5-pentan-3-yl-1,3,4-thiadiazol-2-yl)carbamoyl]benzoate
Type:
Small organic molecule
Emp. Form.:
C16H18N4O5S
Mol. Mass.:
378.403
SMILES:
CCC(CC)c1nnc(NC(=O)c2cc(cc(c2)[N+]([O-])=O)C(=O)OC)s1
: