Target
Dual specificity protein phosphatase 3
Ligand
BDBM88745
Substrate
Meas. Tech.
Dose Response selectivity of inhibitors of STriatal-Enriched Phosphatase (STEP) in the dual-specificity protein-tyrosine phosphatase VHR Inhibition Assay
IC50
2870±n/a nM
Citation
 PubChem, PC Dose Response selectivity of inhibitors of STriatal-Enriched Phosphatase (STEP) in the dual-specificity protein-tyrosine phosphatase VHR Inhibition Assay PubChem Bioassay (2012)[AID] 
Target
Name:
Dual specificity protein phosphatase 3
Synonyms:
DUS3_HUMAN Dual specificity protein phosphatase (VHR) Dual specificity protein phosphatase VHR Tyrosine-protein phosphatase non-receptor type 1 | VHR
Type:
Hydrolase
Mol. Mass.:
20480.58
Organism:
Homo sapiens (Human)
Description:
Residue:
185
  
Inhibitor
Name:
BDBM88745
Synonyms:
3-[(4-chlorophenyl)sulfamoyl]-N-[(E)-4-pyridylmethyleneamino]benzamide MLS000374503 cid_6904494
Type:
Small organic molecule
Emp. Form.:
C19H15ClN4O3S
Mol. Mass.:
414.865
SMILES:
Clc1ccc(NS(=O)(=O)c2cccc(c2)C(=O)N\N=C\c2ccncc2)cc1
: