Target
Dual specificity protein phosphatase 3
Ligand
BDBM57771
Substrate
Meas. Tech.
Dose Response selectivity of inhibitors of STriatal-Enriched Phosphatase (STEP) in the dual-specificity protein-tyrosine phosphatase VHR Inhibition Assay
IC50
3520±n/a nM
Citation
 PubChem, PC Dose Response selectivity of inhibitors of STriatal-Enriched Phosphatase (STEP) in the dual-specificity protein-tyrosine phosphatase VHR Inhibition Assay PubChem Bioassay (2012)[AID] 
Target
Name:
Dual specificity protein phosphatase 3
Synonyms:
DUS3_HUMAN Dual specificity protein phosphatase (VHR) Dual specificity protein phosphatase VHR Tyrosine-protein phosphatase non-receptor type 1 | VHR
Type:
Hydrolase
Mol. Mass.:
20480.58
Organism:
Homo sapiens (Human)
Description:
Residue:
185
  
Inhibitor
Name:
BDBM57771
Synonyms:
6-(1-adamantyl)-4-(1,3-benzodioxol-5-yl)-3,4-dihydro-1H-pyrimidine-2-thione MLS000672341 cid_2969750
Type:
Small organic molecule
Emp. Form.:
C21H24N2O2S
Mol. Mass.:
368.492
SMILES:
[H]C12CC3([H])CC([H])(C1)CC(C2)(C3)C1=NC(=S)NC(C1)c1ccc2OCOc2c1
: