Target
Dual specificity protein phosphatase 3
Ligand
BDBM88771
Substrate
Meas. Tech.
Dose Response selectivity of inhibitors of STriatal-Enriched Phosphatase (STEP) in the dual-specificity protein-tyrosine phosphatase VHR Inhibition Assay
IC50
3030±n/a nM
Citation
 PubChem, PC Dose Response selectivity of inhibitors of STriatal-Enriched Phosphatase (STEP) in the dual-specificity protein-tyrosine phosphatase VHR Inhibition Assay PubChem Bioassay (2012)[AID] 
Target
Name:
Dual specificity protein phosphatase 3
Synonyms:
DUS3_HUMAN Dual specificity protein phosphatase (VHR) Dual specificity protein phosphatase VHR Tyrosine-protein phosphatase non-receptor type 1 | VHR
Type:
Hydrolase
Mol. Mass.:
20480.58
Organism:
Homo sapiens (Human)
Description:
Residue:
185
  
Inhibitor
Name:
BDBM88771
Synonyms:
1-[4-(1H-benzimidazol-2-yl)phenyl]-3-(3-morpholin-4-ylpropyl)thiourea 1-[4-(1H-benzimidazol-2-yl)phenyl]-3-[3-(4-morpholinyl)propyl]thiourea SMR000344056 | cid_2111233
Type:
Small organic molecule
Emp. Form.:
C21H25N5OS
Mol. Mass.:
395.521
SMILES:
S=C(NCCCN1CCOCC1)Nc1ccc(cc1)-c1nc2ccccc2[nH]1
: