Target
Dual specificity protein phosphatase 3
Ligand
BDBM81100
Substrate
Meas. Tech.
Dose Response selectivity of inhibitors of STriatal-Enriched Phosphatase (STEP) in the dual-specificity protein-tyrosine phosphatase VHR Inhibition Assay
IC50
342±n/a nM
Citation
 PubChem, PC Dose Response selectivity of inhibitors of STriatal-Enriched Phosphatase (STEP) in the dual-specificity protein-tyrosine phosphatase VHR Inhibition Assay PubChem Bioassay (2012)[AID] 
Target
Name:
Dual specificity protein phosphatase 3
Synonyms:
DUS3_HUMAN Dual specificity protein phosphatase (VHR) Dual specificity protein phosphatase VHR Tyrosine-protein phosphatase non-receptor type 1 | VHR
Type:
Hydrolase
Mol. Mass.:
20480.58
Organism:
Homo sapiens (Human)
Description:
Residue:
185
  
Inhibitor
Name:
BDBM81100
Synonyms:
1-[5-[(4-chlorophenyl)sulfamoyl]-2-(4-morpholinyl)phenyl]-3-[2-(4-morpholinyl)ethyl]thiourea 1-[5-[(4-chlorophenyl)sulfamoyl]-2-morpholin-4-ylphenyl]-3-(2-morpholin-4-ylethyl)thiourea MLS000774726 cid_3578672
Type:
Small organic molecule
Emp. Form.:
C23H30ClN5O4S2
Mol. Mass.:
540.098
SMILES:
Clc1ccc(NS(=O)(=O)c2ccc(N3CCOCC3)c(NC(=S)NCCN3CCOCC3)c2)cc1
: