Target
Dual specificity protein phosphatase 3
Ligand
BDBM59546
Substrate
Meas. Tech.
Dose Response selectivity of inhibitors of STriatal-Enriched Phosphatase (STEP) in the dual-specificity protein-tyrosine phosphatase VHR Inhibition Assay
IC50
1560±n/a nM
Citation
 PubChem, PC Dose Response selectivity of inhibitors of STriatal-Enriched Phosphatase (STEP) in the dual-specificity protein-tyrosine phosphatase VHR Inhibition Assay PubChem Bioassay (2012)[AID] 
Target
Name:
Dual specificity protein phosphatase 3
Synonyms:
DUS3_HUMAN Dual specificity protein phosphatase (VHR) Dual specificity protein phosphatase VHR Tyrosine-protein phosphatase non-receptor type 1 | VHR
Type:
Hydrolase
Mol. Mass.:
20480.58
Organism:
Homo sapiens (Human)
Description:
Residue:
185
  
Inhibitor
Name:
BDBM59546
Synonyms:
3-[7-(2-chlorobenzyl)oxy-2-keto-4,8-dimethyl-chromen-3-yl]propionic acid 3-[7-[(2-chlorophenyl)methoxy]-4,8-dimethyl-2-oxo-1-benzopyran-3-yl]propanoic acid MLS001213288 cid_1801772
Type:
Small organic molecule
Emp. Form.:
C21H19ClO5
Mol. Mass.:
386.826
SMILES:
Cc1c(OCc2ccccc2Cl)ccc2c(C)c(CCC(O)=O)c(=O)oc12
: