Target
Dual specificity protein phosphatase 3
Ligand
BDBM88790
Substrate
Meas. Tech.
Dose Response selectivity of inhibitors of STriatal-Enriched Phosphatase (STEP) in the dual-specificity protein-tyrosine phosphatase VHR Inhibition Assay
IC50
5400±n/a nM
Citation
 PubChem, PC Dose Response selectivity of inhibitors of STriatal-Enriched Phosphatase (STEP) in the dual-specificity protein-tyrosine phosphatase VHR Inhibition Assay PubChem Bioassay (2012)[AID] 
Target
Name:
Dual specificity protein phosphatase 3
Synonyms:
DUS3_HUMAN Dual specificity protein phosphatase (VHR) Dual specificity protein phosphatase VHR Tyrosine-protein phosphatase non-receptor type 1 | VHR
Type:
Hydrolase
Mol. Mass.:
20480.58
Organism:
Homo sapiens (Human)
Description:
Residue:
185
  
Inhibitor
Name:
BDBM88790
Synonyms:
4-[({[(2E)-3-(4-chlorophenyl)prop-2-enoyl]amino}carbonothioyl)amino]benzoic acid 4-[[(E)-3-(4-chlorophenyl)prop-2-enoyl]carbamothioylamino]benzoic acid MLS001196128 cid_1329095
Type:
Small organic molecule
Emp. Form.:
C17H13ClN2O3S
Mol. Mass.:
360.815
SMILES:
OC(=O)c1ccc(NC(=S)NC(=O)C=Cc2ccc(Cl)cc2)cc1
: