Target
Dual specificity protein phosphatase 3
Ligand
BDBM88797
Substrate
Meas. Tech.
Dose Response selectivity of inhibitors of STriatal-Enriched Phosphatase (STEP) in the dual-specificity protein-tyrosine phosphatase VHR Inhibition Assay
IC50
4320±n/a nM
Citation
 PubChem, PC Dose Response selectivity of inhibitors of STriatal-Enriched Phosphatase (STEP) in the dual-specificity protein-tyrosine phosphatase VHR Inhibition Assay PubChem Bioassay (2012)[AID] 
Target
Name:
Dual specificity protein phosphatase 3
Synonyms:
DUS3_HUMAN Dual specificity protein phosphatase (VHR) Dual specificity protein phosphatase VHR Tyrosine-protein phosphatase non-receptor type 1 | VHR
Type:
Hydrolase
Mol. Mass.:
20480.58
Organism:
Homo sapiens (Human)
Description:
Residue:
185
  
Inhibitor
Name:
BDBM88797
Synonyms:
2-[(5E)-5-[4-[2-(3,4-dimethylanilino)-2-keto-ethoxy]-3-methoxy-benzylidene]-4-keto-2-thioxo-thiazolidin-3-yl]acetic acid 2-[(5E)-5-[[4-[2-(3,4-dimethylanilino)-2-oxoethoxy]-3-methoxyphenyl]methylidene]-4-oxo-2-sulfanylidene-3-thiazolidinyl]acetic acid MLS001034710 cid_2186383
Type:
Small organic molecule
Emp. Form.:
C23H22N2O6S2
Mol. Mass.:
486.561
SMILES:
COc1cc(\C=C2\SC(=S)N(CC(O)=O)C2=O)ccc1OCC(=O)Nc1ccc(C)c(C)c1
: