Target
Dual specificity protein phosphatase 3
Ligand
BDBM88805
Substrate
Meas. Tech.
Dose Response selectivity of inhibitors of STriatal-Enriched Phosphatase (STEP) in the dual-specificity protein-tyrosine phosphatase VHR Inhibition Assay
IC50
927±n/a nM
Citation
 PubChem, PC Dose Response selectivity of inhibitors of STriatal-Enriched Phosphatase (STEP) in the dual-specificity protein-tyrosine phosphatase VHR Inhibition Assay PubChem Bioassay (2012)[AID] 
Target
Name:
Dual specificity protein phosphatase 3
Synonyms:
DUS3_HUMAN Dual specificity protein phosphatase (VHR) Dual specificity protein phosphatase VHR Tyrosine-protein phosphatase non-receptor type 1 | VHR
Type:
Hydrolase
Mol. Mass.:
20480.58
Organism:
Homo sapiens (Human)
Description:
Residue:
185
  
Inhibitor
Name:
BDBM88805
Synonyms:
MLS002179739 N-(5-chloro-2-pyridinyl)-2-[(5,6-dimethyl-4-oxo-3H-thieno[2,3-d]pyrimidin-2-yl)methylthio]propanamide N-(5-chloropyridin-2-yl)-2-[(5,6-dimethyl-4-oxo-3H-thieno[2,3-d]pyrimidin-2-yl)methylsulfanyl]propanamide cid_25162023
Type:
Small organic molecule
Emp. Form.:
C17H17ClN4O2S2
Mol. Mass.:
408.925
SMILES:
CC(SCc1nc2sc(C)c(C)c2c(=O)[nH]1)C(=O)Nc1ccc(Cl)cn1
: