Target
Mitochondrial import inner membrane translocase subunit TIM23
Ligand
BDBM89072
Substrate
Meas. Tech.
SAR analysis of small molecule inhibitors of tim23-1 yeast via a luminescent assay
IC50
617±n/a nM
Citation
 PubChem, PC SAR analysis of small molecule inhibitors of tim23-1 yeast via a luminescent assay PubChem Bioassay (2012)[AID] 
Target
Name:
Mitochondrial import inner membrane translocase subunit TIM23
Synonyms:
MAS6 MPI3 TIM23_YEAST | TPA: Essential component of the Translocase of the Inner Mitochondrial membrane (TIM23 complex)
Type:
Enzyme Catalytic Domain
Mol. Mass.:
23245.32
Organism:
Saccharomyces cerevisiae S288c
Description:
gi_285814664
Residue:
222
  
Inhibitor
Name:
BDBM89072
Synonyms:
MLS-0454741.0001 [(Z)-[azanyl-(2,2-dimethylchromen-6-yl)methylidene]amino] benzoate benzoic acid [(Z)-[amino-(2,2-dimethylchromen-6-yl)methylene]amino] ester | cid_9584415
Type:
Small organic molecule
Emp. Form.:
C19H18N2O3
Mol. Mass.:
322.3578
SMILES:
CC1(C)Oc2ccc(cc2C=C1)C(=N)NOC(=O)c1ccccc1
: