Target
Mitochondrial import inner membrane translocase subunit TIM23
Ligand
BDBM89082
Substrate
Meas. Tech.
SAR analysis of small molecule inhibitors of tim23-1 yeast via a luminescent assay
IC50
51230±n/a nM
Citation
 PubChem, PC SAR analysis of small molecule inhibitors of tim23-1 yeast via a luminescent assay PubChem Bioassay (2012)[AID] 
Target
Name:
Mitochondrial import inner membrane translocase subunit TIM23
Synonyms:
MAS6 MPI3 TIM23_YEAST | TPA: Essential component of the Translocase of the Inner Mitochondrial membrane (TIM23 complex)
Type:
Enzyme Catalytic Domain
Mol. Mass.:
23245.32
Organism:
Saccharomyces cerevisiae S288c
Description:
gi_285814664
Residue:
222
  
Inhibitor
Name:
BDBM89082
Synonyms:
3,7-dimethyl-5-oxidanylidene-N-[3-(trifluoromethyl)phenyl]-[1,3]thiazolo[3,2-a]pyrimidine-6-sulfonamide 3,7-dimethyl-5-oxo-N-[3-(trifluoromethyl)phenyl]-[1,3]thiazolo[3,2-a]pyrimidine-6-sulfonamide MLS-0463353.0001 | cid_15990016
Type:
Small organic molecule
Emp. Form.:
C15H12F3N3O3S2
Mol. Mass.:
403.399
SMILES:
Cc1csc2nc(C)c(c(=O)n12)S(=O)(=O)Nc1cccc(c1)C(F)(F)F
: