Target
Mitochondrial import inner membrane translocase subunit TIM23
Ligand
BDBM89126
Substrate
Meas. Tech.
SAR analysis of small molecule inhibitors of tim23-1 yeast via a luminescent assay
IC50
75630±n/a nM
Citation
 PubChem, PC SAR analysis of small molecule inhibitors of tim23-1 yeast via a luminescent assay PubChem Bioassay (2012)[AID] 
Target
Name:
Mitochondrial import inner membrane translocase subunit TIM23
Synonyms:
MAS6 MPI3 TIM23_YEAST | TPA: Essential component of the Translocase of the Inner Mitochondrial membrane (TIM23 complex)
Type:
Enzyme Catalytic Domain
Mol. Mass.:
23245.32
Organism:
Saccharomyces cerevisiae S288c
Description:
gi_285814664
Residue:
222
  
Inhibitor
Name:
BDBM89126
Synonyms:
3-[4-(3-aminophenoxy)phenoxy]aniline MLS-0463405.0001 cid_13906735
Type:
Small organic molecule
Emp. Form.:
C18H16N2O2
Mol. Mass.:
292.3318
SMILES:
Nc1cccc(Oc2ccc(Oc3cccc(N)c3)cc2)c1
: