Target
Mitochondrial import inner membrane translocase subunit TIM23
Ligand
BDBM78075
Substrate
Meas. Tech.
SAR analysis of small molecule inhibitors of tim23-1 yeast via a luminescent assay
IC50
34220±n/a nM
Citation
 PubChem, PC SAR analysis of small molecule inhibitors of tim23-1 yeast via a luminescent assay PubChem Bioassay (2012)[AID] 
Target
Name:
Mitochondrial import inner membrane translocase subunit TIM23
Synonyms:
MAS6 MPI3 TIM23_YEAST | TPA: Essential component of the Translocase of the Inner Mitochondrial membrane (TIM23 complex)
Type:
Enzyme Catalytic Domain
Mol. Mass.:
23245.32
Organism:
Saccharomyces cerevisiae S288c
Description:
gi_285814664
Residue:
222
  
Inhibitor
Name:
BDBM78075
Synonyms:
2-(4-methylphenoxy)acetic acid [(Z)-[1-amino-2-(4-chlorophenyl)ethylidene]amino] ester SMR000147529 [(Z)-[1-azanyl-2-(4-chlorophenyl)ethylidene]amino] 2-(4-methylphenoxy)ethanoate | cid_5919570
Type:
Small organic molecule
Emp. Form.:
C17H17ClN2O3
Mol. Mass.:
332.781
SMILES:
Cc1ccc(OCC(=O)ONC(=N)Cc2ccc(Cl)cc2)cc1
: