Target
Mitochondrial import inner membrane translocase subunit TIM23
Ligand
BDBM53447
Substrate
Meas. Tech.
SAR analysis of small molecule inhibitors of tim23-1 yeast via a luminescent assay
IC50
52660±n/a nM
Citation
 PubChem, PC SAR analysis of small molecule inhibitors of tim23-1 yeast via a luminescent assay PubChem Bioassay (2012)[AID] 
Target
Name:
Mitochondrial import inner membrane translocase subunit TIM23
Synonyms:
MAS6 MPI3 TIM23_YEAST | TPA: Essential component of the Translocase of the Inner Mitochondrial membrane (TIM23 complex)
Type:
Enzyme Catalytic Domain
Mol. Mass.:
23245.32
Organism:
Saccharomyces cerevisiae S288c
Description:
gi_285814664
Residue:
222
  
Inhibitor
Name:
BDBM53447
Synonyms:
4,4'-[1,4-phenylenebis(oxy)]diphenol 4-[4-(4-oxidanylphenoxy)phenoxy]phenol O-acyl oxime isatin derivative, 13 cid_786365
Type:
Small organic molecule
Emp. Form.:
C18H14O4
Mol. Mass.:
294.3014
SMILES:
Oc1ccc(Oc2ccc(Oc3ccc(O)cc3)cc2)cc1
: