Target
High affinity choline transporter 1
Ligand
BDBM78579
Substrate
Meas. Tech.
Dose responses of compounds that activate the Choline Transporter (CHT) - 10 point CRC
EC50
14810±n/a nM
Citation
 PubChem, PC Dose responses of compounds that activate the Choline Transporter (CHT) - 10 point CRC PubChem Bioassay (2012)[AID] 
Target
Name:
High affinity choline transporter 1
Synonyms:
CHT1 SC5A7_HUMAN high affinity choline transporter 1
Type:
PROTEIN
Mol. Mass.:
63194.33
Organism:
Homo sapiens (Human)
Description:
ChEMBL_1464247
Residue:
580
  
Inhibitor
Name:
BDBM78579
Synonyms:
MLS000121357 N-[1-(5-bromanyl-2-pentoxy-phenyl)ethylideneamino]-4,5-dihydro-1H-imidazol-2-amine SMR000118779 [1-(2-amoxy-5-bromo-phenyl)ethylideneamino]-(2-imidazolin-2-yl)amine | cid_3104172
Type:
Small organic molecule
Emp. Form.:
C16H23BrN4O
Mol. Mass.:
367.284
SMILES:
CCCCCOc1ccc(Br)cc1C(C)=NNC1=NCCN1
: