Target
High affinity choline transporter 1
Ligand
BDBM77122
Substrate
Meas. Tech.
Dose responses of compounds that activate the Choline Transporter (CHT) - 10 point CRC
EC50
16000±n/a nM
Citation
 PubChem, PC Dose responses of compounds that activate the Choline Transporter (CHT) - 10 point CRC PubChem Bioassay (2012)[AID] 
Target
Name:
High affinity choline transporter 1
Synonyms:
CHT1 SC5A7_HUMAN high affinity choline transporter 1
Type:
PROTEIN
Mol. Mass.:
63194.33
Organism:
Homo sapiens (Human)
Description:
ChEMBL_1464247
Residue:
580
  
Inhibitor
Name:
BDBM77122
Synonyms:
1-[(1-tert-amyltetrazol-5-yl)-(3-pyridyl)methyl]-4-[3-(trifluoromethyl)phenyl]piperazine 1-[[1-(2-methylbutan-2-yl)-5-tetrazolyl]-(3-pyridinyl)methyl]-4-[3-(trifluoromethyl)phenyl]piperazine 1-{[1-(1,1-Dimethyl-propyl)-1H-tetrazol-5-yl]-pyridin-3-yl-methyl}-4-(3-trifluoromethyl-phenyl)-piperazine SMR000119988 | cid_3229211
Type:
Small organic molecule
Emp. Form.:
C23H28F3N7
Mol. Mass.:
459.5105
SMILES:
CCC(C)(C)n1nnnc1C(N1CCN(CC1)c1cccc(c1)C(F)(F)F)c1cccnc1
: