Target
High affinity choline transporter 1
Ligand
BDBM70736
Substrate
Meas. Tech.
Dose responses of compounds that activate the Choline Transporter (CHT) - 10 point CRC
EC50
16700±n/a nM
Citation
 PubChem, PC Dose responses of compounds that activate the Choline Transporter (CHT) - 10 point CRC PubChem Bioassay (2012)[AID] 
Target
Name:
High affinity choline transporter 1
Synonyms:
CHT1 SC5A7_HUMAN high affinity choline transporter 1
Type:
PROTEIN
Mol. Mass.:
63194.33
Organism:
Homo sapiens (Human)
Description:
ChEMBL_1464247
Residue:
580
  
Inhibitor
Name:
BDBM70736
Synonyms:
2-Chloro-N-(5-chloro-3-methyl-1-phenyl-1H-pyrazol-4-ylmethyl)-N-naphthalen-1-yl-acetamide 2-chloro-N-[(5-chloro-3-methyl-1-phenyl-4-pyrazolyl)methyl]-N-(1-naphthalenyl)acetamide 2-chloro-N-[(5-chloro-3-methyl-1-phenylpyrazol-4-yl)methyl]-N-naphthalen-1-ylacetamide SMR000177101 | cid_3134137
Type:
Small organic molecule
Emp. Form.:
C23H19Cl2N3O
Mol. Mass.:
424.322
SMILES:
Cc1nn(c(Cl)c1CN(C(=O)CCl)c1cccc2ccccc12)-c1ccccc1
: