Target
High affinity choline transporter 1
Ligand
BDBM89164
Substrate
Meas. Tech.
Dose responses of compounds that activate the Choline Transporter (CHT) - 10 point CRC
EC50
22720±n/a nM
Citation
 PubChem, PC Dose responses of compounds that activate the Choline Transporter (CHT) - 10 point CRC PubChem Bioassay (2012)[AID] 
Target
Name:
High affinity choline transporter 1
Synonyms:
CHT1 SC5A7_HUMAN high affinity choline transporter 1
Type:
PROTEIN
Mol. Mass.:
63194.33
Organism:
Homo sapiens (Human)
Description:
ChEMBL_1464247
Residue:
580
  
Inhibitor
Name:
BDBM89164
Synonyms:
(3R,3aS,7R,7aS)-2-benzyl-7-methyl-3-(3-nitrophenyl)-3a,6,7,7a-tetrahydro-3H-isoindol-1-one MLS000882835 cid_16746352
Type:
Small organic molecule
Emp. Form.:
C22H22N2O3
Mol. Mass.:
362.4217
SMILES:
C[C@@H]1CC=C[C@H]2[C@H]1C(=O)N(Cc1ccccc1)[C@H]2c1cccc(c1)[N+]([O-])=O
: