Target
High affinity choline transporter 1
Ligand
BDBM83397
Substrate
Meas. Tech.
Dose responses of compounds that activate the Choline Transporter (CHT) - 10 point CRC
EC50
8400±n/a nM
Citation
 PubChem, PC Dose responses of compounds that activate the Choline Transporter (CHT) - 10 point CRC PubChem Bioassay (2012)[AID] 
Target
Name:
High affinity choline transporter 1
Synonyms:
CHT1 SC5A7_HUMAN high affinity choline transporter 1
Type:
PROTEIN
Mol. Mass.:
63194.33
Organism:
Homo sapiens (Human)
Description:
ChEMBL_1464247
Residue:
580
  
Inhibitor
Name:
BDBM83397
Synonyms:
2-(2,4-dimethoxy-3-methyl-benzyl)-1,3,4,9-tetrahydro-beta-carboline 2-[(2,4-dimethoxy-3-methyl-phenyl)methyl]-1,3,4,9-tetrahydropyrido[3,4-b]indole MLS001000473 cid_785909
Type:
Small organic molecule
Emp. Form.:
C21H24N2O2
Mol. Mass.:
336.4275
SMILES:
COc1ccc(CN2CCc3c(C2)[nH]c2ccccc32)c(OC)c1C
: