Target
Mitochondrial import inner membrane translocase subunit TIM10
Ligand
BDBM39541
Substrate
Meas. Tech.
SAR analysis of small molecule inhibitors of tim23-1: a luminescent tim10-1 yeast counterscreen.
IC50
24600±n/a nM
Citation
 PubChem, PC SAR analysis of small molecule inhibitors of tim23-1: a luminescent tim10-1 yeast counterscreen. PubChem Bioassay (2012)[AID] 
Target
Name:
Mitochondrial import inner membrane translocase subunit TIM10
Synonyms:
MRS11 TIM10_YEAST TPA: Essential protein of the mitochondrial intermembrane space, forms a complex with Tim9p (TIM10 complex) that delivers hydrophobic proteins to the TIM22 complex for insertion into the inner ...
Type:
Enzyme Catalytic Domain
Mol. Mass.:
10303.50
Organism:
Saccharomyces cerevisiae S288c
Description:
gi_285809906
Residue:
93
  
Inhibitor
Name:
BDBM39541
Synonyms:
MLS000041618 N-[2-(5-bromo-2-furanyl)-3H-benzimidazol-5-yl]-2-thiophenecarboxamide N-[2-(5-bromofuran-2-yl)-3H-benzimidazol-5-yl]thiophene-2-carboxamide cid_664956
Type:
Small organic molecule
Emp. Form.:
C16H10BrN3O2S
Mol. Mass.:
388.239
SMILES:
Brc1ccc(o1)-c1nc2ccc(NC(=O)c3cccs3)cc2[nH]1
: