Target
Mitochondrial import inner membrane translocase subunit TIM10
Ligand
BDBM89070
Substrate
Meas. Tech.
SAR analysis of small molecule inhibitors of tim23-1: a luminescent TIM10 yeast counterscreen.
IC50
9170±n/a nM
Citation
 PubChem, PC SAR analysis of small molecule inhibitors of tim23-1: a luminescent TIM10 yeast counterscreen. PubChem Bioassay (2012)[AID] 
Target
Name:
Mitochondrial import inner membrane translocase subunit TIM10
Synonyms:
MRS11 TIM10_YEAST TPA: Essential protein of the mitochondrial intermembrane space, forms a complex with Tim9p (TIM10 complex) that delivers hydrophobic proteins to the TIM22 complex for insertion into the inner ...
Type:
Enzyme Catalytic Domain
Mol. Mass.:
10303.50
Organism:
Saccharomyces cerevisiae S288c
Description:
gi_285809906
Residue:
93
  
Inhibitor
Name:
BDBM89070
Synonyms:
1,3-benzothiazole-6-carboxylic acid [(Z)-[amino(phenyl)methylene]amino] ester MLS-0454739.0001 [(Z)-[azanyl(phenyl)methylidene]amino] 1,3-benzothiazole-6-carboxylate | cid_9584424
Type:
Small organic molecule
Emp. Form.:
C15H11N3O2S
Mol. Mass.:
297.332
SMILES:
NC(=NOC(=O)c1ccc2ncsc2c1)c1ccccc1
: