Target
Mitochondrial import inner membrane translocase subunit TIM10
Ligand
BDBM89084
Substrate
Meas. Tech.
SAR analysis of small molecule inhibitors of tim23-1: a luminescent TIM10 yeast counterscreen.
IC50
>99000±n/a nM
Citation
 PubChem, PC SAR analysis of small molecule inhibitors of tim23-1: a luminescent TIM10 yeast counterscreen. PubChem Bioassay (2012)[AID] 
Target
Name:
Mitochondrial import inner membrane translocase subunit TIM10
Synonyms:
MRS11 TIM10_YEAST TPA: Essential protein of the mitochondrial intermembrane space, forms a complex with Tim9p (TIM10 complex) that delivers hydrophobic proteins to the TIM22 complex for insertion into the inner ...
Type:
Enzyme Catalytic Domain
Mol. Mass.:
10303.50
Organism:
Saccharomyces cerevisiae S288c
Description:
gi_285809906
Residue:
93
  
Inhibitor
Name:
BDBM89084
Synonyms:
5-keto-N-(2-methoxy-5-nitro-phenyl)-3,7-dimethyl-thiazolo[3,2-a]pyrimidine-6-sulfonamide N-(2-methoxy-5-nitro-phenyl)-3,7-dimethyl-5-oxidanylidene-[1,3]thiazolo[3,2-a]pyrimidine-6-sulfonamide N-(2-methoxy-5-nitrophenyl)-3,7-dimethyl-5-oxo-[1,3]thiazolo[3,2-a]pyrimidine-6-sulfonamide | cid_46249010
Type:
Small organic molecule
Emp. Form.:
C15H14N4O6S2
Mol. Mass.:
410.425
SMILES:
COc1ccc(cc1NS(=O)(=O)c1c(C)nc2scc(C)n2c1=O)[N+]([O-])=O
: